{"text_format":"1","workbook":"xlsx","n_sheets":6,"sheets":["Conversion","SPC","UTM","Conic","Cylindric","GRS80_&_Units"],"not_rendered":{"charts":0,"images":3,"macros":1,"external_links":0,"defined_names":14,"comments":0,"pivot_tables":0},"unopened":[],"bounds":{"document_bytes":16777216,"sheet_cells":100000,"rows_first":2000,"rows_last":500,"rows_between":2000,"halvings":0,"cell_chars":16384,"cell_head_chars":4096},"cells_cut":0,"cells_raw":0,"read":"whole","date_system":"1900"}

{"sheet":"Conversion","index":0,"n_rows":19,"n_cols":12,"rows_kept":19,"cut":false,"hidden":false,"merged":[]}
["Iowa NAD 83 Coordinate Conversions"]
["Version 0.5 - 1/07/26"]
[null,null,"Select units"]
[null,null,"from list",null,null,"This workbook DOES NOT not convert coordinates between datum realizations"]
[null,"Units","Survey Ft","Enter values to convert in the colored cells"]
[]
[null,null,null,"Lat (DD.MMSSss)","Long (DD.MMSSss)",{"$f":" \"North (\"&C5&\")\"","v":"North (Survey Ft)"},{"$f":" \"East (\"&C5&\")\"","v":"East (Survey Ft)"},"Convergence","Grid Scale"]
[null,"State Plane","North",43.19435,90.273700000000005,{"$f":"SPC!C9","v":3961840.2074806131},{"$f":"SPC!C10","v":5729930.0806082916},{"$f":"SPC!C11","v":"+2°03'36.559\""},{"$f":"SPC!C12","v":1.0000119345405813}]
[null,null,null,{"$f":"SPC!F9","v":"+33°01'25.951412\""},{"$f":"SPC!F10","v":"+101°37'40.658373\""},300000,2400000,{"$f":"SPC!F11","v":"-5°30'31.252\""},{"$f":"SPC!F12","v":1.0135431013363376}]
[]
[null,"UTM","14N",43.182016922999999,95.464457523999997,{"$f":"UTM!C9","v":15747316.012479769},{"$f":"UTM!C10","v":2497494.6875167191},{"$f":"UTM!C11","v":"+2°12'37.666\""},{"$f":"UTM!C12","v":1.0004395817774308}]
[null,null,null,{"$f":"UTM!F9","v":"+43°18'20.169230\""},{"$f":"UTM!F10","v":"+95°46'44.575240\""},15747316.012499999,2497494.6875,{"$f":"UTM!F11","v":"+2°12'37.666\""},{"$f":"UTM!F12","v":1.0004395813770384}]
[]
[null,"Conic","Spencer",43.182016922999999,95.464457523999997,{"$f":"Conic!C9","v":9638938.5122315139},{"$f":"Conic!C10","v":11359164.493505035},{"$f":"Conic!C11","v":"-0°21'43.771\""},{"$f":"Conic!C37","v":1.0000536935664828}]
[null,"See Map",null,{"$f":"Conic!F9","v":"+43°18'20.169230\""},{"$f":"Conic!F10","v":"+95°46'44.575240\""},9638938.5121999998,11359164.4935,{"$f":"Conic!F11","v":"-0°21'43.771\""},{"$f":"Conic!G46","v":1.0000536935664801}]
[]
[null,"Cylindric","Council Bluffs",41.132638362000002,95.511159336000006,{"$f":"Cylindric!C9","v":6954894.9804267846},{"$f":"Cylindric!C10","v":16467018.155491151},{"$f":"Cylindric!C11","v":"-0°04'44.422\""},{"$f":"Cylindric!C12","v":1.0000402431834046}]
[null,"See Map",null,{"$f":"Cylindric!F9","v":"+41°13'26.383620\""},{"$f":"Cylindric!F10","v":"+95°51'11.593360\""},6954894.9803999998,16467018.1555,{"$f":"Cylindric!F11","v":"-0°04'44.422\""},{"$f":"Cylindric!F12","v":1.0000402431834039}]
[null,null,null,null,null,null,null,null,null,null,null," "]

{"sheet":"SPC","index":1,"n_rows":58,"n_cols":15,"rows_kept":58,"cut":false,"hidden":true,"merged":[]}
["SPC -  Lambert Conic"]
[]
[null,"Units",{"$f":"Conversion!C5","v":"Survey Ft"},null,{"$f":"VLOOKUP($C$3,Units,3,FALSE)","v":"to get survey feet"}]
[null,"Zone",{"$f":"Conversion!C8","v":"North"},null,{"$f":"HLOOKUP($C$4,ZoneInfo,2,FALSE)&\" Zone\"","v":"North Zone"}]
[]
[null,"Direct Conversion",null,null,"Inverse Conversion"]
[null,"Lat (f)",{"$f":"Conversion!D8","v":43.19435},"d.ms","N",{"$f":"Conversion!F9","v":300000},{"$f":"E3","v":"to get survey feet"}]
[null,"Long (l)",{"$f":"Conversion!E8","v":90.273700000000005},"d.ms","E",{"$f":"Conversion!G9","v":2400000},{"$f":"E3","v":"to get survey feet"}]
[null,"N",{"$f":"C41","v":3961840.2074806131},{"$f":"E3","v":"to get survey feet"},"Lat (f)",{"$f":"H43","v":"+33°01'25.951412\""}]
[null,"E",{"$f":"C42","v":5729930.0806082916},{"$f":"E3","v":"to get survey feet"},"Long (l)",{"$f":"H42","v":"+101°37'40.658373\""}]
[null,"g",{"$f":"C39","v":"+2°03'36.559\""},null,"g",{"$f":"H44","v":"-5°30'31.252\""}]
[null,"k",{"$f":"C40","v":1.0000119345405813},null,"k",{"$f":"H45","v":1.0135431013363376}]
[]
["Zone Parameters",null,null,null,null,null,null,null,null,null,"Wis SPC Parameters"]
[null,"Code",{"$f":"HLOOKUP($C$4,ZoneInfo,3,FALSE)","v":1401},null,null,null,null,null,null,null,null,"Zone","North","South"]
["fs","Std Par S",{"$f":"HLOOKUP($C$4,ZoneInfo,4,FALSE)","v":42.04},{"$f":"RADIANS(DMStoDD(C16))","v":0.73420183867228128},"radians",null,"Ellipsoid",null,null,null,null,"Name","North","South"]
["fn","Std Par N",{"$f":"HLOOKUP($C$4,[0]!ZoneInfo,5,FALSE)","v":43.16},{"$f":"RADIANS(DMStoDD(C17))","v":0.75514578969621315},"radians",null,"a",{"$f":"'GRS80_&_Units'!C4*VLOOKUP($C$3,Units,2,FALSE)","v":20925604.474166665},{"$f":"$E$3","v":"to get survey feet"},null,null,"Code",1401,1402]
["lo","Origin Long",{"$f":"HLOOKUP($C$4,ZoneInfo,6,FALSE)","v":93.3},{"$f":"RADIANS(DMStoDD(C18))","v":1.6318828506146978},"radians",null,"b",{"$f":"'GRS80_&_Units'!C5*VLOOKUP($C$3,Units,2,FALSE)","v":20855444.883975454},{"$f":"$E$3","v":"to get survey feet"},null,"fs","Std Par S",42.04,40.369999999999997,"d.ms"]
["fb","Origin Lat",{"$f":"HLOOKUP($C$4,ZoneInfo,7,FALSE)","v":41.3},{"$f":"RADIANS(DMStoDD(C19))","v":0.72431163957764666},"radians",null,"f",{"$f":"'GRS80_&_Units'!C6","v":3.3528106811836675E-3},null,null,"fn","Std Par N",43.16,41.47,"d.ms"]
["Nb","Origin N",{"$f":"HLOOKUP($C$4,ZoneInfo,8,FALSE)","v":1000000},{"$f":"C20*VLOOKUP($C$3,Units,2,FALSE)","v":3280833.3333333335},{"$f":"$E$3","v":"to get survey feet"},null,"e",{"$f":"SQRT('GRS80_&_Units'!C7)","v":8.1819191042832778E-2},null,null,"lo","Origin Long",93.3,93.3,"d.ms"]
["Eo","Origin E",{"$f":"HLOOKUP($C$4,ZoneInfo,9,FALSE)","v":1500000},{"$f":"C21*VLOOKUP($C$3,Units,2,FALSE)","v":4921250},{"$f":"$E$3","v":"to get survey feet"},null,"e'",{"$f":"SQRT('GRS80_&_Units'!C8)","v":8.209443815193436E-2},null,null,"fb","Origin Lat",41.3,40,"d.ms"]
[null,null,null,null,null,null,null,null,null,null,"Nb","Origin N",1000000,0,"meters"]
["Zone Constants",null,null,null,null,null,null,null,null,null,"Eo","Origin E",1500000,500000,"meters"]
[null,null,"Q","W",null,null,"fo",{"$f":"ASIN((LN(D26*COS(D16)/(D25*COS(D17))))/(C26-C25))","v":0.74469090597452936},"radians"]
[null,"South (Qs)",{"$f":"Q(H20,D16)","v":0.80624406415890937},{"$f":"W(H20,D16)","v":0.99849633904280977},null,null,null,{"$f":"FormatAngle(DDtoDMS(DEGREES(H24)),3)","v":"+42°40'03.525\""},"Central Latitude"]
[null,"North (Qn)",{"$f":"Q(H20,D17)","v":0.83462525459597214},{"$f":"W(H20,D17)","v":0.99842636550310804},null,null,"K",{"$f":"(H17*COS(D16)*EXP(C25*SIN(H24)))/(D25*SIN(H24))","v":39645498.45990859},{"$f":"$E$3","v":"to get survey feet"}]
[null,"Grid Origin (Qb)",{"$f":"Q(H20,D19)","v":0.79302993124926346},null,null,null,"Rb",{"$f":"H26/(EXP(C27*SIN(H24)))","v":23161830.40284441},{"$f":"$E$3","v":"to get survey feet"}]
[null,"Central (Qo)",{"$f":"Q(H20,H24)","v":0.82038883560817089},{"$f":"W(H20,H24)","v":0.99846132568665602},null,null,"Ro",{"$f":"H26/(EXP(C28*SIN(H24)))","v":22736312.903680231},{"$f":"$E$3","v":"to get survey feet"}]
[null,null,null,null,null,null,"ko",{"$f":"(D28*TAN(H24)*H28)/(H17)","v":0.99994536787025134}]
[null,null,null,null,null,null,"No",{"$f":"H27+D20-H28","v":3706350.8324975111},{"$f":"$E$3","v":"to get survey feet"}]
{"$rows_left_out":29}
{"sheet":"UTM","index":2,"n_rows":66,"n_cols":15,"rows_kept":66,"cut":false,"hidden":true,"merged":[]}
["Transverse Mercator Cylindric"]
[]
[null,"Units",{"$f":"Conversion!C5","v":"Survey Ft"},"M, F, S",{"$f":"VLOOKUP($C$3,Units,3,FALSE)","v":"to get survey feet"}]
[null,"Zone",{"$f":"Conversion!C11","v":"14N"},"14, 15",{"$f":"HLOOKUP($C$4,TMZoneInfo,2,FALSE)&\" Zone\"","v":"14N Zone"}]
[]
[null,"Direct Conversion",null,null,"Inverse Conversion"]
[null,"Lat (f)",{"$f":"Conversion!D11","v":43.182016922999999},"d.ms","N",{"$f":"Conversion!F12","v":15747316.012499999},{"$f":"E3","v":"to get survey feet"}]
[null,"Long (l)",{"$f":"Conversion!E11","v":95.464457523999997},"d.ms","E",{"$f":"Conversion!G12","v":2497494.6875},{"$f":"E3","v":"to get survey feet"}]
[null,"N",{"$f":"C54","v":15747316.012479769},{"$f":"E3","v":"to get survey feet"},"Lat (f)",{"$f":"H56","v":"+43°18'20.169230\""}]
[null,"E",{"$f":"C55","v":2497494.6875167191},{"$f":"E3","v":"to get survey feet"},"Long (l)",{"$f":"H57","v":"+95°46'44.575240\""}]
[null,"g",{"$f":"C63","v":"+2°12'37.666\""},null,"g",{"$f":"H65","v":"+2°12'37.666\""}]
[null,"k",{"$f":"C64","v":1.0004395817774308},null,"k",{"$f":"H66","v":1.0004395813770384}]
[]
["Zone Parameters",null,null,null,null,null,null,null,null,null,"UTM Parameters"]
[null,"Code",{"$f":"HLOOKUP($C$4,TMZoneInfo,1,FALSE)","v":"14N"},null,null,null,null,null,null,null,null,"Code","15N","14N"]
[null,"Name",{"$f":"HLOOKUP($C$4,TMZoneInfo,2,FALSE)","v":"14N"},null,null,null,"Ellipsoid",null,null,null,null,"Name","15N","14N"]
["lo","Cen Mer",{"$f":"HLOOKUP($C$4,TMZoneInfo,3,FALSE)","v":99},{"$f":"RADIANS(DMStoDD(C17))","v":1.7278759594743862},"radians",null,"a",{"$f":"'GRS80_&_Units'!C4*VLOOKUP($C$3,Units,2,FALSE)","v":20925604.474166665},{"$f":"$E$3","v":"to get survey feet"},null,"lo","Cen Mer",93,99,"d.ms"]
["ko","Scale- 1:",{"$f":"HLOOKUP($C$4,TMZoneInfo,4,FALSE)","v":2500},{"$f":"1-1/C18","v":0.99960000000000004},null,null,"b",{"$f":"'GRS80_&_Units'!C5*VLOOKUP($C$3,Units,2,FALSE)","v":20855444.883975454},{"$f":"$E$3","v":"to get survey feet"},null,null,"Scale- 1:",2500,2500]
["lo","Origin Long",{"$f":"HLOOKUP($C$4,TMZoneInfo,5,FALSE)","v":99},{"$f":"RADIANS(DMStoDD(C19))","v":1.7278759594743862},"radians",null,"f",{"$f":"'GRS80_&_Units'!C6","v":3.3528106811836675E-3},null,null,"lo","Origin Long",93,99,"d.ms"]
["fo","Origin Lat",{"$f":"HLOOKUP($C$4,TMZoneInfo,6,FALSE)","v":0},{"$f":"RADIANS(DMStoDD(C20))","v":0},"radians",null,"e",{"$f":"SQRT('GRS80_&_Units'!C7)","v":8.1819191042832778E-2},null,null,"fo","Origin Lat",0,0,"d.ms"]
["No","Origin N",{"$f":"HLOOKUP($C$4,TMZoneInfo,7,FALSE)","v":0},{"$f":"C21*VLOOKUP($C$3,Units,2,FALSE)","v":0},{"$f":"$E$3","v":"to get survey feet"},null,"e'",{"$f":"SQRT('GRS80_&_Units'!C8)","v":8.209443815193436E-2},null,null,"No","Origin N",0,0,"meters"]
["Eo","Origin E",{"$f":"HLOOKUP($C$4,TMZoneInfo,8,FALSE)","v":500000},{"$f":"C22*VLOOKUP($C$3,Units,2,FALSE)","v":1640416.6666666667},{"$f":"$E$3","v":"to get survey feet"},null,null,null,null,null,"Eo","Origin E",500000,500000,"meters"]
[]
["Zone Constants"]
[null,"n",{"$f":"(H17-H18)/(H17+H18)","v":1.6792203946294406E-3}]
[null,"r",{"$f":"H17*(1-C25)*(1-C25^2)*(1+9*C25^2/4+225*C25^4/64)","v":20890539.405750498},{"$f":"$E$3","v":"to get survey feet"}]
[null,"u2",{"$f":"-3*C25/2+9*C25^3/16","v":-2.5188279284875425E-3},null,"v2",{"$f":"3*C25/2-27*C25^3/32","v":2.5188265967592332E-3}]
[null,"u4",{"$f":"15*C25^2/16-15*C25^4/32","v":2.643541085771844E-6},null,"v4",{"$f":"21*C25^2/16-55*C25^4/32","v":3.7009490719670861E-6}]
[null,"u6",{"$f":"-35*C25^3/48","v":-3.4526289497048255E-9},null,"v6",{"$f":"151*C25^3/96","v":7.4478138772204098E-9}]
[null,"u8",{"$f":"315*C25^4/512","v":4.8918304243960608E-12},null,"v8",{"$f":"1097*C25^4/512","v":1.7035993573214219E-11}]
{"$rows_left_out":37}
{"sheet":"Conic","index":3,"n_rows":46,"n_cols":17,"rows_kept":46,"cut":false,"hidden":true,"merged":[]}
["IARS Single Parallel Conic Systems"]
[]
[null,"Units",{"$f":"Conversion!C5","v":"Survey Ft"}]
[null,"County",{"$f":"Conversion!C14","v":"Spencer"}]
[]
[null,"Direct Conversion",null,null,"Inverse Conversion"]
[null,"Lat (f)",{"$f":"Conversion!D14","v":43.182016922999999},"d.ms","N",{"$f":"Conversion!F15","v":9638938.5121999998},{"$f":"C3","v":"Survey Ft"}]
[null,"Long (l)",{"$f":"Conversion!E14","v":95.464457523999997},"d.ms","E",{"$f":"Conversion!G15","v":11359164.4935},{"$f":"C3","v":"Survey Ft"}]
[null,"N",{"$f":"C40","v":9638938.5122315139},{"$f":"C3","v":"Survey Ft"},"Lat (f)",{"$f":"FormatAngle(DDtoDMS(DEGREES(G45)),6)","v":"+43°18'20.169230\""}]
[null,"E",{"$f":"C39","v":11359164.493505035},{"$f":"C3","v":"Survey Ft"},"Long (l)",{"$f":"FormatAngle(DDtoDMS(DEGREES(-G26)),6)","v":"+95°46'44.575240\""}]
[null,"g",{"$f":"C36","v":"-0°21'43.771\""},null,"g",{"$f":"FormatAngle(DDtoDMS(DEGREES(G25)),3)","v":"-0°21'43.771\""}]
[null,"k",{"$f":"C37","v":1.0000536935664828},null,"k",{"$f":"G46","v":1.0000536935664801}]
[]
["County Parameters",null,"from table","for computations",null,"Zone Constants"]
[null,"County",{"$f":"VLOOKUP($C$4,IARS_Cone,1,FALSE)","v":"Spencer"},null,null," vo",{"$f":"J17/(SQRT(1-J20^2*SIN(D17)^2))","v":20958503.900170151},null,null,null,null,"County Parameters - WisCRS Conic"]
["lO","CM Long",{"$f":"VLOOKUP($C$4,IARS_Cone,2,FALSE)","v":95.15},{"$f":"RADIANS(DMStoDD(C16))*(-1)","v":-1.6624261125245992},"radians"," ro",{"$f":"(J17*(1-J20^2))/((1-J20^2*SIN(D17)^2)^1.5)","v":20883712.296151198},null,"GRS80 Ellipsoid",null,null,null,"Long (Cen Mer)","False Easting","False Northing","Lat (Cen Par)","Scale"]
["fO","CP Lat",{"$f":"VLOOKUP($C$4,IARS_Cone,5,FALSE)","v":43.12},{"$f":"RADIANS(DMStoDD(C17))","v":0.7539822368615503},"radians"," ro",{"$f":"(C20*G15)/TAN(D17)","v":22319700.352775536},null,"a",{"$f":"'GRS80_&_Units'!C4*VLOOKUP(C3,Units,2,FALSE)","v":20925604.474166665},{"$f":"C3","v":"Survey Ft"},"Zone","(d.ms)","(Meters)","(Meters)","(d.ms)","(Cen Par)"]
["EO","False E",{"$f":"VLOOKUP($C$4,IARS_Cone,3,FALSE)","v":3505207.0104140211},{"$f":"C18*VLOOKUP(C3,Units,2,FALSE)","v":11500000},{"$f":"C3","v":"Survey Ft"}," A0",{"$f":"1-J20^2/4-3*J20^4/64-5*J20^6/256","v":0.99832429844458415},null,"b",{"$f":"'GRS80_&_Units'!C5*VLOOKUP(C3,Units,2,FALSE)","v":20855444.883975454},{"$f":"C3","v":"Survey Ft"},"Spencer",95.15,{"$f":"N27*12/39.37","v":3505207.0104140211},{"$f":"O27*12/39.37","v":2926085.8521717046},43.12,1.0000519999999999]
["NO","False N",{"$f":"VLOOKUP($C$4,IARS_Cone,4,FALSE)","v":2926085.8521717046},{"$f":"C19*VLOOKUP(C3,Units,2,FALSE)","v":9600000},{"$f":"C3","v":"Survey Ft"}," A2",{"$f":"(3/8)*(J20^2+J20^4/4+15*J20^6/128)","v":2.5146070728458659E-3},null,"f",{"$f":"'GRS80_&_Units'!C6","v":3.3528106811836675E-3},null,"Mason City",92.45,{"$f":"N28*12/39.37","v":3810007.6200152403},2987045.9740919485,43.1,1.000043]
["kO","CP Scale",{"$f":"VLOOKUP($C$4,IARS_Cone,6,FALSE)","v":1.0000519999999999},null,null," A4",{"$f":"(15/256)*(J20^4+3*J20^6/4)","v":2.639046620233096E-6},null,"e",{"$f":"SQRT('GRS80_&_Units'!C7)","v":8.1819191042832778E-2},null,"Iowa",94.5,{"$f":"N29*12/39.37","v":4419608.8392176786},2621285.2425704855,42.32,1.0000450000000001]
[null,null,null,null,null," A6",{"$f":"(35/3072)*J20^6","v":3.4180461367794719E-9},null,"e'",{"$f":"SQRT('GRS80_&_Units'!C8)","v":8.209443815193436E-2},null,"Warerloo",92.25,{"$f":"N30*12/39.37","v":4724409.4488188978},2712725.4254508512,42.39,1.000032]
[null,null,null,null,null," Mo",{"$f":"J17*(G18*D17-G19*SIN(2*D17)+G20*SIN(4*D17)-G21*SIN(6*D17))","v":15698586.782238444},null,null,null,null,"Cedar Rapids",91.4,{"$f":"N31*12/39.37","v":6248412.4968249938},2438404.8768097539,41.5,1.0000199999999999]
[null,null,null,null,null,null,null,null,null,null,null,"Red Oak-Ottumwa",93.45,{"$f":"N32*12/39.37","v":6858013.7160274321},1889763.7795275592,40.549999999999997,1.0000370000000001]
["Direct Conversion",null,"d.ms",null,null,"Inverse Conversion"]
[null,"Lat (f)",{"$f":"C7","v":43.182016922999999},{"$f":"RADIANS(DMStoDD(C25))","v":0.75582534929995915},"radians","g",{"$f":"ATAN((F8-D18)/(G17-F7+D19))","v":-6.3208624502246015E-3},"radians",{"$f":"FormatAngle(DDtoDMS(DEGREES(G25)),3)","v":"-0°21'43.771\""}]
[null,"Long (l)",{"$f":"C8*-1","v":-95.464457523999997},{"$f":"RADIANS(DMStoDD(C26))","v":-1.6716597538551434},"radians","Long (l)",{"$f":"(G25/SIN(D17))+D16","v":-1.6716597538554605},"radians",null,null,null,null,null,"(SFeet)","(SFeet)"]
[null,"Mf",{"$f":"J17*(G18*D25-G19*SIN(2*D25)+G20*SIN(4*D25)-G21*SIN(6*D25))","v":15737078.168777632},null,null,"iterative comps for M",1,2,3,null,null,"Spencer",null,11500000,9600000]
[null,"M",{"$f":"C27-G22","v":38491.386539187282},null,null,"s",{"$f":"F7-D19-(F8-D18)*TAN(G25/2)","v":38493.409785709067},null,null,null,null,"Mason City",null,12500000,9800000]
[null,"M3",{"$f":"C28^3/(6*G16*G15)","v":2.171558017915827E-2},null,null,"Ma",{"$f":"G28/C20","v":38491.408232480979},{"$f":"G29+G37","v":38491.386507644056},{"$f":"H29+H37","v":38491.386507644056},null,null,"Iowa",null,14500000,8600000]
[null,"M4",{"$f":"(C28^4*TAN(D17)*(1-4*J21^2*COS(D17)^2))/(24*G16*G15^2)","v":9.228748545465933E-6},null,null,"M3a",{"$f":"G29^3/(6*G16*G15)","v":2.1715616895117324E-2},{"$f":"H29^3/(6*G16*G15)","v":2.1715580125771298E-2},{"$f":"I29^3/(6*G16*G15)","v":2.1715580125771298E-2},null,null,"Warerloo",null,15500000,8900000]
{"$rows_left_out":17}
{"sheet":"Cylindric","index":4,"n_rows":65,"n_cols":16,"rows_kept":65,"cut":false,"hidden":true,"merged":[]}
["IARS Transverse Mercator Cylindric Systems"]
[]
[null,"Units",{"$f":"Conversion!C5","v":"Survey Ft"}]
[null,"County",{"$f":"Conversion!C17","v":"Council Bluffs"}]
[]
[null,"Direct Conversion",null,null,"Inverse Conversion"]
[null,"Lat (f)",{"$f":"Conversion!D17","v":41.132638362000002},"d.ms","N",{"$f":"Conversion!F18","v":6954894.9803999998},{"$f":"C3","v":"Survey Ft"}]
[null,"Long (l)",{"$f":"Conversion!E17","v":95.511159336000006},"d.ms","E",{"$f":"Conversion!G18","v":16467018.1555},{"$f":"C3","v":"Survey Ft"}]
[null,"N",{"$f":"C53","v":6954894.9804267846},{"$f":"C3","v":"Survey Ft"},"Lat (f)",{"$f":"H55","v":"+41°13'26.383620\""}]
[null,"E",{"$f":"C54","v":16467018.155491151},{"$f":"C3","v":"Survey Ft"},"Long (l)",{"$f":"H56","v":"+95°51'11.593360\""}]
[null,"g",{"$f":"C62","v":"-0°04'44.422\""},null,"g",{"$f":"H64","v":"-0°04'44.422\""}]
[null,"k",{"$f":"C63","v":1.0000402431834046},null,"k",{"$f":"H65","v":1.0000402431834039}]
[]
["Zone Parameters",null,null,null,null,null,null,"GRS80 Ellipsoid"]
[null,"County",{"$f":"VLOOKUP($C$4,IARS_Cyl,1,FALSE)","v":"Council Bluffs"},null,null,null,null,"a",{"$f":"'GRS80_&_Units'!C4*VLOOKUP(C3,Units,2,FALSE)","v":20925604.474166665},{"$f":"C3","v":"Survey Ft"},"County Parameters - WisCRS Cylindric"]
[null,"lo",{"$f":"VLOOKUP($C$4,IARS_Cyl,2,FALSE)","v":95.44},{"$f":"RADIANS(DMStoDD(C16))","v":1.6708618705759046},"radians",null,null,"b",{"$f":"'GRS80_&_Units'!C5*VLOOKUP(C3,Units,2,FALSE)","v":20855444.883975454},{"$f":"C3","v":"Survey Ft"},null,"Long (Cen Mer)","Lat (Origin)","False Easting","False Northing","Scale"]
[null,"fo",{"$f":"VLOOKUP($C$4,IARS_Cyl,3,FALSE)","v":40.15},{"$f":"RADIANS(DMStoDD(C17))","v":0.70249502392771757},"radians",null,null,"f",{"$f":"'GRS80_&_Units'!C6","v":3.3528106811836675E-3},null,"Zone","(d.ms)","(d.ms)","(meters)","(meters)","(Cen Mer)"]
[null,"ko",{"$f":"VLOOKUP($C$4,IARS_Cyl,6,FALSE)","v":1.0000389999999999},null,null,null,null,"e",{"$f":"Conic!J20","v":8.1819191042832778E-2},null,"Elkader",91.12,40.15,{"$f":"N30*12/39.37","v":4114808.2296164595},{"$f":"O30*12/39.37","v":2529845.0596901197},1.000035]
[null,"No",{"$f":"VLOOKUP($C$4,IARS_Cyl,5,FALSE)","v":2011684.0233680469},{"$f":"C19*VLOOKUP(C3,Units,2,FALSE)","v":6600000},{"$f":"C3","v":"Survey Ft"},null,null,"e'",{"$f":"SQRT('GRS80_&_Units'!C8)","v":8.209443815193436E-2},null,"Council Bluffs",95.44,40.15,{"$f":"N31*12/39.37","v":5029210.058420117},2011684.0233680469,1.0000389999999999]
[null,"Eo",{"$f":"VLOOKUP($C$4,IARS_Cyl,4,FALSE)","v":5029210.058420117},{"$f":"C20*VLOOKUP(C3,Units,2,FALSE)","v":16500000},{"$f":"C3","v":"Survey Ft"},null,null,null,null,null,"Carrol-Atlantic",94.38,40.15,{"$f":"N32*12/39.37","v":5334010.6680213362},2072644.1452882907,1.0000450000000001]
[null,null,null,null,null,null,null,null,null,null,"Ames-Des Moines",93.43,40.15,{"$f":"N33*12/39.37","v":5638811.2776225554},2133604.2672085348,1.0000329999999999]
[null,null,null,null,null,null,null,null,null,null,"Newton",92.49,40.15,{"$f":"N34*12/39.37","v":5943611.8872237746},2194564.3891287786,1.000027]
["Zone Constants",null,null,null,null,null,null,null,null,null,"Dubuque-Davenport",90.32,40.15,{"$f":"N35*12/39.37","v":6553213.1064262129},2316484.6329692663,1.000027]
[null,"n",{"$f":"(I15-I16)/(I15+I16)","v":1.6792203946294406E-3},null,null,null,null,null,null,null,"Fairfield",91.55,40.15,{"$f":"N36*12/39.37","v":7162814.3256286513},1950723.901447803,1.0002]
[null,"r",{"$f":"I15*(1-C24)*(1-C24^2)*(1+9*C24^2/4+225*C24^4/64)","v":20890539.405750498},{"$f":"C3","v":"Survey Ft"},null,null,null,null,null,null,"Burlington",91.25,40.15,{"$f":"N37*12/39.37","v":7467614.9352298705},1889763.7795275592,1.0000180000000001]
[null,"u2",{"$f":"-3*C24/2+9*C24^3/16","v":-2.5188279284875425E-3},null,"v2",{"$f":"3*C24/2-27*C24^3/32","v":2.5188265967592332E-3}]
[null,"u4",{"$f":"15*C24^2/16-15*C24^4/32","v":2.643541085771844E-6},null,"v4",{"$f":"21*C24^2/16-55*C24^4/32","v":3.7009490719670861E-6}]
[null,"u6",{"$f":"-35*C24^3/48","v":-3.4526289497048255E-9},null,"v6",{"$f":"151*C24^3/96","v":7.4478138772204098E-9}]
[null,"u8",{"$f":"315*C24^4/512","v":4.8918304243960608E-12},null,"v8",{"$f":"1097*C24^4/512","v":1.7035993573214219E-11},null,null,null,null,null,null,null,"(SFeet)","(SFeet)"]
[null,"U0",{"$f":"2*(C26-2*C27+3*C28-4*C29)","v":-5.0482507762265134E-3},null,"V0",{"$f":"2*(F26-2*F27+3*F28-4*F29)","v":5.0228939478259129E-3},null,null,null,null,"Elkader",null,null,13500000,8300000]
{"$rows_left_out":36}
{"sheet":"GRS80_&_Units","index":5,"n_rows":17,"n_cols":5,"rows_kept":17,"cut":false,"hidden":true,"merged":[]}
["Ellipsoid and Units"]
[]
["GRS 80 Ellipsoid Parameters"]
[null,"a",6378137,"semimajor axis, meters","fixed"]
[null,"b",{"$f":"C4-C4*C6","v":6356752.3141403468},"semiminor axis; meters","computed"]
[null,"f",{"$f":"1/298.25722210088","v":3.3528106811836675E-3},"flattening","fixed"]
[null,"e2",{"$f":"(C4^2-C5^2)/C4^2","v":6.6943800229035668E-3},"first eccentricity squared","computed"]
[null,"e' 2",{"$f":"(C4^2-C5^2)/C5^2","v":6.7394967754817754E-3},"second eccentricity squared","computed"]
[]
["Unit Conversion Constants"]
[null,"Unit","Multiply units by:"]
[null,"Meters",1,"to get meters"]
[null,"Int'l Ft",{"$f":"1000/(25.4*12)","v":3.2808398950131239},"to get int'l feet"]
[null,"Survey Ft",{"$f":"39.37/12","v":3.2808333333333333},"to get survey feet"]
[]
[null,"Note - Base units are meters."]
[null,null," The above conversions are multipiers"]